probationer-n
type: LexicalEntry
canonical form: probationer
sense: 10497298-n
part of speech: noun

student nurse-n
type: LexicalEntry
canonical form: student nurse
sense: 10497298-n
part of speech: noun

10497298-n
type: LexicalConcept
in scheme: en-word.net
definition: a nurse in training who is undergoing a trial period
ili: i92266
lexfile: noun.person
part of speech: noun
hypernym: 10386665-n