streetlight-n
type: LexicalEntry
canonical form: streetlight
sense: 04343024-n
part of speech: noun

street lamp-n
type: LexicalEntry
canonical form: street lamp
sense: 04343024-n
part of speech: noun

04343024-n
type: LexicalConcept
in scheme: en-word.net
definition: a lamp supported on a lamppost; for illuminating a street
ili: i59675
lexfile: noun.artifact
part of speech: noun
hypernym: 03641539-n
mero part: 03642472-n