stipendiary-n
type: LexicalEntry
canonical form: stipendiary
sense: 10676408-n
part of speech: noun

stipendiary magistrate-n
type: LexicalEntry
canonical form: stipendiary magistrate
sense: 10676408-n
part of speech: noun

10676408-n
type: LexicalConcept
in scheme: en-word.net
definition: (United Kingdom) a paid magistrate (appointed by the Home Secretary) dealing with police cases
ili: i93325
lexfile: noun.person
part of speech: noun
domain region: 08879115-n
hypernym: 10300642-n