steamer-v
type: LexicalEntry
canonical form: steamer
sense: 01948835-v
part of speech: verb

steam-v
type: LexicalEntry
canonical form: steam
sense: 01948835-v
part of speech: verb

01948835-v
type: LexicalConcept
in scheme: en-word.net
definition: travel by means of steam power
example: The ship steamed off into the Pacific
ili: i31448
lexfile: verb.motion
part of speech: verb
domain topic: 00817462-n
hypernym: 01839438-v

soft-shell clam-n
type: LexicalEntry
canonical form: soft-shell clam
sense: 01959976-n
part of speech: noun
sense: 07803405-n

steamer-n
type: LexicalEntry
canonical form: steamer
sense: 01959976-n
part of speech: noun
sense: 04316486-n
sense: 04316686-n
sense: 07803405-n

steamer clam-n
type: LexicalEntry
canonical form: steamer clam
sense: 01959976-n
part of speech: noun
sense: 07803405-n

long-neck clam-n
type: LexicalEntry
canonical form: long-neck clam
sense: 01959976-n
part of speech: noun
sense: 07803405-n

Mya arenaria-n
type: LexicalEntry
canonical form: Mya arenaria
sense: 01959976-n
part of speech: noun

01959976-n
type: LexicalConcept
in scheme: en-word.net
definition: an edible clam with thin oval-shaped shell found in coastal regions of the United States and Europe
ili: i45628
lexfile: noun.animal
part of speech: noun
hypernym: 01959122-n
mero part: 07803405-n

steamship-n
type: LexicalEntry
canonical form: steamship
sense: 04316486-n
part of speech: noun

04316486-n
type: LexicalConcept
in scheme: en-word.net
definition: a ship powered by one or more steam engines
ili: i59518
lexfile: noun.artifact
part of speech: noun
hypernym: 04201332-n
mero part: 04316187-n

04316686-n
type: LexicalConcept
in scheme: en-word.net
definition: a cooking utensil that can be used to cook food by steaming it
ili: i59519
lexfile: noun.artifact
part of speech: noun
hypernym: 03106637-n

07803405-n
type: LexicalConcept
in scheme: en-word.net
definition: a clam that is usually steamed in the shell
ili: i78012
lexfile: noun.food
part of speech: noun
hypernym: 07802662-n