standing-n
type: LexicalEntry
canonical form: standing
sense: 00349906-n
part of speech: noun
sense: 06508107-n
sense: 13971316-n

00349906-n
type: LexicalConcept
in scheme: en-word.net
definition: the act of assuming or maintaining an erect upright position
ili: i37245
lexfile: noun.act
part of speech: noun
hypernym: 00332776-n

standing-a
type: LexicalEntry
canonical form: standing
sense: 01240306-s
part of speech: adjective
sense: https://en-word.net/lemma/standing-a#01242735-a
sense: https://en-word.net/lemma/standing-a#01243108-a
sense: https://en-word.net/lemma/standing-a#01243938-a
sense: 01760020-s
sense: 01978028-s

01240306-s
type: LexicalConcept
in scheme: en-word.net
definition: having a supporting base
example: a standing lamp
ili: i6771
lexfile: adj.all
part of speech: adjective satellite
similar: https://en-word.net/synset/01238732-a

https://en-word.net/synset/01242735-a
type: LexicalConcept
in scheme: en-word.net
definition: (of persons) on the feet; having the torso in an erect position supported by straight legs
example: standing room only
ili: i6787
lexfile: adj.all
part of speech: adjective

https://en-word.net/synset/01243108-a
type: LexicalConcept
in scheme: en-word.net
definition: executed in or initiated from a standing position
example: race from a standing start
example: a standing jump
example: a standing ovation
ili: i6789
lexfile: adj.all
part of speech: adjective

https://en-word.net/synset/01243938-a
type: LexicalConcept
in scheme: en-word.net
definition: (of fluids) not moving or flowing
example: mosquitoes breed in standing water
ili: i6794
lexfile: adj.all
part of speech: adjective
similar: 01244121-s
similar: 01244328-s
similar: 01244473-s

01760020-s
type: LexicalConcept
in scheme: en-word.net
definition: not created for a particular occasion
example: a standing committee
ili: i9635
lexfile: adj.all
part of speech: adjective satellite
similar: https://en-word.net/synset/01758923-a

01978028-s
type: LexicalConcept
in scheme: en-word.net
definition: permanent
example: a standing army
ili: i10799
lexfile: adj.all
part of speech: adjective satellite
similar: https://en-word.net/synset/01977842-a

06508107-n
type: LexicalConcept
in scheme: en-word.net
definition: an ordered listing of scores or results showing the relative positions of competitors (individuals or teams) in a sporting event
ili: i70596
lexfile: noun.communication
part of speech: noun
hypernym: 06492991-n

13971316-n
type: LexicalConcept
in scheme: en-word.net
definition: social or financial or professional status or reputation
example: of equal standing
example: a member in good standing
ili: i110236
lexfile: noun.state
part of speech: noun
hypernym: 13968971-n