bracket-n
type: LexicalEntry
canonical form: bracket
sense: 06855340-n
part of speech: noun

square bracket-n
type: LexicalEntry
canonical form: square bracket
sense: 06855340-n
part of speech: noun

06855340-n
type: LexicalConcept
in scheme: en-word.net
definition: either of two punctuation marks (‘[’ or ‘]’) used to enclose textual material
ili: i72476
lexfile: noun.communication
part of speech: noun
hypernym: 06854415-n