species-n
type: LexicalEntry
canonical form: species
sense: 05853408-n
part of speech: noun
sense: 08127339-n

05853408-n
type: LexicalConcept
in scheme: en-word.net
definition: a specific kind of something
example: a species of molecule
example: a species of villainy
ili: i67588
lexfile: noun.cognition
part of speech: noun
hypernym: 05847533-n

08127339-n
type: LexicalConcept
in scheme: en-word.net
definition: (biology) taxonomic group whose members can interbreed
ili: i79804
lexfile: noun.group
part of speech: noun
domain topic: 06047178-n
hypernym: 08008892-n
mero member: 08118376-n
mero member: 08128123-n
mero part: 08118051-n