spar-n
type: LexicalEntry
canonical form: spar
sense: 00447789-n
part of speech: noun
sense: 04274687-n
sense: 15073663-n

sparring-n
type: LexicalEntry
canonical form: sparring
sense: 00447789-n
part of speech: noun

00447789-n
type: LexicalConcept
in scheme: en-word.net
definition: making the motions of attack and defense with the fists and arms; a part of training for a boxer
ili: i37751
lexfile: noun.act
part of speech: noun
hypernym: 00446787-n

spar-v
type: LexicalEntry
canonical form: spar
sense: 00775967-v
part of speech: verb
sense: 01422848-v
sense: 01422958-v
sense: 02367699-v

00775967-v
type: LexicalConcept
in scheme: en-word.net
definition: fight verbally
example: They were sparring all night
ili: i25560
lexfile: verb.communication
part of speech: verb
hypernym: 00775477-v

01422848-v
type: LexicalConcept
in scheme: en-word.net
definition: box lightly
ili: i28831
lexfile: verb.contact
part of speech: verb
domain topic: 00524569-n
hypernym: 01422636-v

01422958-v
type: LexicalConcept
in scheme: en-word.net
definition: fight with spurs
example: the gamecocks were sparring
ili: i28832
lexfile: verb.contact
part of speech: verb
domain topic: 00453138-n
domain topic: 00524569-n
hypernym: 01092746-v

02367699-v
type: LexicalConcept
in scheme: en-word.net
definition: furnish with spars
ili: i33567
lexfile: verb.possession
part of speech: verb
hypernym: 02344409-v

04274687-n
type: LexicalConcept
in scheme: en-word.net
definition: a stout rounded pole of wood or metal used to support rigging
ili: i59257
lexfile: noun.artifact
part of speech: noun
hypernym: 03983015-n

15073663-n
type: LexicalConcept
in scheme: en-word.net
definition: any of various nonmetallic minerals (calcite or feldspar) that are light in color and transparent or translucent and cleavable
ili: i116255
lexfile: noun.substance
part of speech: noun
hypernym: 14686753-n