solder-v
type: LexicalEntry
canonical form: solder
sense: 01598181-v
part of speech: verb

01598181-v
type: LexicalConcept
in scheme: en-word.net
definition: join or fuse with solder
example: solder these two pipes together
ili: i29711
lexfile: verb.contact
part of speech: verb
hypernym: 01293672-v

solder-n
type: LexicalEntry
canonical form: solder
sense: 14742983-n
part of speech: noun

14742983-n
type: LexicalConcept
in scheme: en-word.net
definition: an alloy (usually of lead and tin) used when melted to join two metal surfaces
ili: i114346
lexfile: noun.substance
part of speech: noun
hypernym: 14610949-n