softness-n
type: LexicalEntry
canonical form: softness
sense: 04646214-n
part of speech: noun
sense: 04675496-n
sense: 04711694-n
sense: 04918150-n
sense: 04945405-n
sense: 04963596-n
sense: 04997999-n
sense: 14513443-n
sense: 14546172-n
sense: 14570961-n

04646214-n
type: LexicalConcept
in scheme: en-word.net
definition: a disposition to be lenient in judging others
example: softness is not something permitted of good leaders
ili: i61451
lexfile: noun.attribute
part of speech: noun
hypernym: 04645942-n

effeminacy-n
type: LexicalEntry
canonical form: effeminacy
sense: 04675496-n
part of speech: noun

effeminateness-n
type: LexicalEntry
canonical form: effeminateness
sense: 04675496-n
part of speech: noun

sissiness-n
type: LexicalEntry
canonical form: sissiness
sense: 04675496-n
part of speech: noun

womanishness-n
type: LexicalEntry
canonical form: womanishness
sense: 04675496-n
part of speech: noun

unmanliness-n
type: LexicalEntry
canonical form: unmanliness
sense: 04675496-n
part of speech: noun

04675496-n
type: LexicalConcept
in scheme: en-word.net
definition: the trait of being effeminate (derogatory of a man)
example: the students associated science with masculinity and arts with effeminacy
example: Spartans accused Athenians of effeminateness
example: he was shocked by the softness of the atmosphere surrounding the young prince, arising from the superfluity of the femininity that guided him
ili: i61597
lexfile: noun.attribute
part of speech: noun
exemplifies: 06730109-n
hypernym: 04674763-n

indistinctness-n
type: LexicalEntry
canonical form: indistinctness
sense: 04711694-n
part of speech: noun

blurriness-n
type: LexicalEntry
canonical form: blurriness
sense: 04711694-n
part of speech: noun

fogginess-n
type: LexicalEntry
canonical form: fogginess
sense: 04711694-n
part of speech: noun

fuzziness-n
type: LexicalEntry
canonical form: fuzziness
sense: 04711694-n
part of speech: noun

04711694-n
type: LexicalConcept
in scheme: en-word.net
definition: the quality of being indistinct and without sharp outlines
ili: i61778
lexfile: noun.attribute
part of speech: noun
hypernym: 04710772-n

gentleness-n
type: LexicalEntry
canonical form: gentleness
sense: 04918150-n
part of speech: noun

mildness-n
type: LexicalEntry
canonical form: mildness
sense: 04918150-n
part of speech: noun

04918150-n
type: LexicalConcept
in scheme: en-word.net
definition: acting in a manner that is gentle and mild and even-tempered
example: his fingers have learned gentleness
example: suddenly her gigantic power melted into softness for the baby
example: even in the pulpit there are moments when mildness of manner is not enough
ili: i62796
lexfile: noun.attribute
part of speech: noun
hypernym: 04917312-n

04945405-n
type: LexicalConcept
in scheme: en-word.net
definition: the property of giving little resistance to pressure and being easily cut or molded
ili: i62928
lexfile: noun.attribute
part of speech: noun
hypernym: 04941723-n

04963596-n
type: LexicalConcept
in scheme: en-word.net
definition: a visual property that is subdued and free from brilliance or glare
example: the softness of the morning sky
ili: i63024
lexfile: noun.attribute
part of speech: noun
hypernym: 04957303-n

04997999-n
type: LexicalConcept
in scheme: en-word.net
definition: a sound property that is free from loudness or stridency
example: and in softness almost beyond hearing
ili: i63229
lexfile: noun.attribute
part of speech: noun
hypernym: 04990371-n

14513443-n
type: LexicalConcept
in scheme: en-word.net
definition: a state of declining economic condition
example: orders have recently picked up after a period of extreme softness
example: he attributes the disappointing results to softness in the economy
ili: i113149
lexfile: noun.state
part of speech: noun
hypernym: 14512178-n

balminess-n
type: LexicalEntry
canonical form: balminess
sense: 14546172-n
part of speech: noun

14546172-n
type: LexicalConcept
in scheme: en-word.net
definition: the quality of weather that is deliciously mild and soothing
example: the day's heat faded into balminess
example: the climate had the softness of the south of France
ili: i113319
lexfile: noun.state
part of speech: noun
hypernym: 14546010-n

unfitness-n
type: LexicalEntry
canonical form: unfitness
sense: 14570961-n
part of speech: noun

14570961-n
type: LexicalConcept
in scheme: en-word.net
definition: poor physical condition; being out of shape or out of condition (as from a life of ease and luxury)
ili: i113451
lexfile: noun.state
part of speech: noun
hypernym: 14075528-n