snail-v
type: LexicalEntry
canonical form: snail
sense: 01385571-v
part of speech: verb

01385571-v
type: LexicalConcept
in scheme: en-word.net
definition: gather snails
example: We went snailing in the summer
ili: i28623
lexfile: verb.contact
part of speech: verb
hypernym: 01383303-v

snail-n
type: LexicalEntry
canonical form: snail
sense: 01947031-n
part of speech: noun
sense: 07798451-n

01947031-n
type: LexicalConcept
in scheme: en-word.net
definition: freshwater or marine or terrestrial gastropod mollusk usually having an external enclosing spiral shell
ili: i45553
lexfile: noun.animal
part of speech: noun
hypernym: 01944818-n

escargot-n
type: LexicalEntry
canonical form: escargot
sense: 07798451-n
part of speech: noun

07798451-n
type: LexicalConcept
in scheme: en-word.net
definition: edible terrestrial snail usually served in the shell with a sauce of melted butter and garlic
ili: i77981
lexfile: noun.food
part of speech: noun
hypernym: 07665463-n