smirk-v
type: LexicalEntry
canonical form: smirk
sense: 00029329-v
part of speech: verb

simper-v
type: LexicalEntry
canonical form: simper
sense: 00029329-v
part of speech: verb

00029329-v
type: LexicalConcept
in scheme: en-word.net
definition: smile affectedly or derisively
ili: i21908
lexfile: verb.body
part of speech: verb
hypernym: 00028558-v

smirk-n
type: LexicalEntry
canonical form: smirk
sense: 06891630-n
part of speech: noun

06891630-n
type: LexicalConcept
in scheme: en-word.net
definition: a smile expressing smugness or scorn instead of pleasure
ili: i72645
lexfile: noun.communication
part of speech: noun
hypernym: 06891121-n