slingback-n
type: LexicalEntry
canonical form: slingback
sense: 04246893-n
part of speech: noun

sling-n
type: LexicalEntry
canonical form: sling
sense: 04246893-n
part of speech: noun

04246893-n
type: LexicalConcept
in scheme: en-word.net
definition: a shoe that has a strap that wraps around the heel
ili: i59075
lexfile: noun.artifact
part of speech: noun
hypernym: 04206070-n