sleet-v
type: LexicalEntry
canonical form: sleet
sense: 02765212-v
part of speech: verb

02765212-v
type: LexicalConcept
in scheme: en-word.net
definition: precipitate as a mixture of rain and snow
example: If the temperature rises above freezing, it will probably sleet
ili: i35478
lexfile: verb.weather
part of speech: verb
hypernym: 02762779-v

sleet-n
type: LexicalEntry
canonical form: sleet
sense: 11528369-n
part of speech: noun

11528369-n
type: LexicalConcept
in scheme: en-word.net
definition: partially melted snow (or a mixture of rain and snow)
ili: i98070
lexfile: noun.phenomenon
part of speech: noun
hypernym: 11515038-n