siphon-n
type: LexicalEntry
canonical form: siphon
sense: 01471554-n
part of speech: noun
sense: 04231230-n

syphon-n
type: LexicalEntry
canonical form: syphon
sense: 01471554-n
part of speech: noun
sense: 04231230-n

01471554-n
type: LexicalConcept
in scheme: en-word.net
definition: a tubular organ in an aquatic animal (especially in mollusks) through which water can be taken in or expelled
ili: i43025
lexfile: noun.animal
part of speech: noun
domain topic: 06092831-n
hypernym: 05305022-n

siphon-v
type: LexicalEntry
canonical form: siphon
sense: 01616295-v
part of speech: verb
sense: 01857528-v

01616295-v
type: LexicalConcept
in scheme: en-word.net
definition: move a liquid from one container into another by means of a siphon or a siphoning action
example: siphon gas into the tank
ili: i29823
lexfile: verb.contact
part of speech: verb
hypernym: 01496967-v

syphon-v
type: LexicalEntry
canonical form: syphon
sense: 01857528-v
part of speech: verb

siphon off-v
type: LexicalEntry
canonical form: siphon off
sense: 01857528-v
part of speech: verb

01857528-v
type: LexicalConcept
in scheme: en-word.net
definition: convey, draw off, or empty by or as if by a siphon
ili: i30969
lexfile: verb.motion
part of speech: verb
hypernym: 01858118-v

04231230-n
type: LexicalConcept
in scheme: en-word.net
definition: a tube running from the liquid in a vessel to a lower level outside the vessel so that gravity forces the liquid through the tube
ili: i58971
lexfile: noun.artifact
part of speech: noun
hypernym: 04500800-n