shower-v
type: LexicalEntry
canonical form: shower
sense: 00035252-v
part of speech: verb
sense: 01186866-v
sense: 01375659-v
sense: 02269409-v
sense: 02763609-v

00035252-v
type: LexicalConcept
in scheme: en-word.net
definition: take a shower; wash one's body in the shower
example: You should shower after vigorous exercise
ili: i21942
lexfile: verb.body
part of speech: verb
hypernym: 00035596-v

shower-n-1
type: LexicalEntry
canonical form: shower
sense: 00258447-n
part of speech: noun
sense: 04216003-n
sense: 07378268-n
sense: 08272716-n
sense: 11522915-n

shower bath-n
type: LexicalEntry
canonical form: shower bath
sense: 00258447-n
part of speech: noun

00258447-n
type: LexicalConcept
in scheme: en-word.net
definition: washing yourself by standing upright under water sprayed from a nozzle
example: he took a shower after the game
ili: i36748
lexfile: noun.act
part of speech: noun
hypernym: 00256081-n

01186866-v
type: LexicalConcept
in scheme: en-word.net
definition: provide abundantly with
example: He showered her with presents
ili: i27538
lexfile: verb.consumption
part of speech: verb
hypernym: 01185006-v

01375659-v
type: LexicalConcept
in scheme: en-word.net
definition: spray or sprinkle with
example: The guests showered rice on the couple
ili: i28573
lexfile: verb.contact
part of speech: verb
hypernym: 01375347-v

lavish-v
type: LexicalEntry
canonical form: lavish
sense: 02269409-v
part of speech: verb

02269409-v
type: LexicalConcept
in scheme: en-word.net
definition: expend profusely; also used with abstract nouns
example: He was showered with praise
ili: i33056
lexfile: verb.possession
part of speech: verb
hypernym: 01160479-v

shower down-v
type: LexicalEntry
canonical form: shower down
sense: 02763609-v
part of speech: verb

02763609-v
type: LexicalConcept
in scheme: en-word.net
definition: rain abundantly
example: Meteors showered down over half of Australia
ili: i35469
lexfile: verb.weather
part of speech: verb
hypernym: 02762516-v

04216003-n
type: LexicalConcept
in scheme: en-word.net
definition: a plumbing fixture that sprays water over you
example: they installed a shower in the bathroom
ili: i58872
lexfile: noun.artifact
part of speech: noun
hypernym: 03975617-n
mero part: 04216450-n

cascade-n
type: LexicalEntry
canonical form: cascade
sense: 07378268-n
part of speech: noun

07378268-n
type: LexicalConcept
in scheme: en-word.net
definition: a sudden downpour (as of tears or sparks etc.) likened to a rain shower
example: a little shower of rose petals
example: a sudden cascade of sparks
ili: i75389
lexfile: noun.event
part of speech: noun
hypernym: 07377946-n

08272716-n
type: LexicalConcept
in scheme: en-word.net
definition: a party of friends assembled to present gifts (usually of a specified kind) to a person
example: her friends organized a baby shower for her when she was expecting
ili: i80520
lexfile: noun.group
part of speech: noun
hypernym: 07462241-n

exhibitor-n
type: LexicalEntry
canonical form: exhibitor
sense: 10090370-n
part of speech: noun

exhibitioner-n
type: LexicalEntry
canonical form: exhibitioner
sense: 10090370-n
part of speech: noun

shower-n-2
type: LexicalEntry
canonical form: shower
sense: 10090370-n
part of speech: noun

10090370-n
type: LexicalConcept
in scheme: en-word.net
definition: someone who organizes an exhibit for others to see
ili: i89841
lexfile: noun.person
part of speech: noun
hypernym: 10613153-n

rain shower-n
type: LexicalEntry
canonical form: rain shower
sense: 11522915-n
part of speech: noun

11522915-n
type: LexicalConcept
in scheme: en-word.net
definition: a brief period of precipitation
example: the game was interrupted by a brief shower
ili: i98041
lexfile: noun.phenomenon
part of speech: noun
hypernym: 11521799-n