shepherd-v
type: LexicalEntry
canonical form: shepherd
sense: 02555741-v
part of speech: verb
sense: 02555865-v

02555741-v
type: LexicalConcept
in scheme: en-word.net
definition: tend as a shepherd, as of sheep or goats
ili: i34444
lexfile: verb.social
part of speech: verb
hypernym: 02555544-v

02555865-v
type: LexicalConcept
in scheme: en-word.net
definition: watch over like a shepherd, as a teacher of their pupils
ili: i34445
lexfile: verb.social
part of speech: verb
hypernym: 01131763-v

sheepherder-n
type: LexicalEntry
canonical form: sheepherder
sense: 10607013-n
part of speech: noun

shepherd-n
type: LexicalEntry
canonical form: shepherd
sense: 10607013-n
part of speech: noun
sense: 10608373-n

10607013-n
type: LexicalConcept
in scheme: en-word.net
definition: a herder of sheep (on an open range); someone who keeps the sheep together in a flock
ili: i92924
lexfile: noun.person
part of speech: noun
hypernym: 10191239-n

10608373-n
type: LexicalConcept
in scheme: en-word.net
definition: a clergyman who watches over a group of people
ili: i92934
lexfile: noun.person
part of speech: noun
hypernym: 09946909-n