shampoo-v
type: LexicalEntry
canonical form: shampoo
sense: 00041748-v
part of speech: verb

00041748-v
type: LexicalConcept
in scheme: en-word.net
definition: use shampoo on (hair)
ili: i21978
lexfile: verb.body
part of speech: verb
hypernym: 00036355-v

shampoo-n
type: LexicalEntry
canonical form: shampoo
sense: 00257982-n
part of speech: noun
sense: 04190559-n

00257982-n
type: LexicalConcept
in scheme: en-word.net
definition: the act of washing your hair with shampoo
ili: i36745
lexfile: noun.act
part of speech: noun
hypernym: 00258095-n

04190559-n
type: LexicalConcept
in scheme: en-word.net
definition: cleansing agent consisting of soaps or detergents used for washing the hair
ili: i58734
lexfile: noun.artifact
part of speech: noun
hypernym: 03044572-n