reproductive organ-n
type: LexicalEntry
canonical form: reproductive organ
sense: 05520953-n
part of speech: noun

sex organ-n
type: LexicalEntry
canonical form: sex organ
sense: 05520953-n
part of speech: noun

05520953-n
type: LexicalConcept
in scheme: en-word.net
definition: any organ involved in sexual reproduction
ili: i65901
lexfile: noun.body
part of speech: noun
hypernym: 05305022-n