sewer-n-1
type: LexicalEntry
canonical form: sewer
sense: 04186187-n
part of speech: noun

sewerage-n
type: LexicalEntry
canonical form: sewerage
sense: 04186187-n
part of speech: noun
sense: 14881044-n

cloaca-n
type: LexicalEntry
canonical form: cloaca
sense: 04186187-n
part of speech: noun

04186187-n
type: LexicalConcept
in scheme: en-word.net
definition: a waste pipe that carries away sewage or surface water
ili: i58711
lexfile: noun.artifact
part of speech: noun
hypernym: 03236615-n

sewage-n
type: LexicalEntry
canonical form: sewage
sense: 14881044-n
part of speech: noun

14881044-n
type: LexicalConcept
in scheme: en-word.net
definition: waste matter carried away in sewers or drains
ili: i115130
lexfile: noun.substance
part of speech: noun
hypernym: 14880414-n
mero substance: 14881172-n