scrutineer-n
type: LexicalEntry
canonical form: scrutineer
sense: 10584930-n
part of speech: noun

canvasser-n
type: LexicalEntry
canonical form: canvasser
sense: 10584930-n
part of speech: noun

10584930-n
type: LexicalConcept
in scheme: en-word.net
definition: someone who examines votes at an election
ili: i92797
lexfile: noun.person
part of speech: noun
domain region: 08879115-n
hypernym: 10087775-n