schedule-v
type: LexicalEntry
canonical form: schedule
sense: 00680201-v
part of speech: verb
sense: 00796643-v

00680201-v
type: LexicalConcept
in scheme: en-word.net
definition: plan for an activity or event
example: I've scheduled a concert next week
ili: i25109
lexfile: verb.cognition
part of speech: verb
hypernym: 00706456-v

00796643-v
type: LexicalConcept
in scheme: en-word.net
definition: make a schedule; plan the time and place for events
example: I scheduled an exam for this afternoon
ili: i25654
lexfile: verb.communication
part of speech: verb
hypernym: 00706456-v

agenda-n
type: LexicalEntry
canonical form: agenda
sense: 05919534-n
part of speech: noun

docket-n
type: LexicalEntry
canonical form: docket
sense: 05919534-n
part of speech: noun

schedule-n
type: LexicalEntry
canonical form: schedule
sense: 05919534-n
part of speech: noun
sense: 06507319-n

05919534-n
type: LexicalConcept
in scheme: en-word.net
definition: a temporally organized plan for matters to be attended to
ili: i67903
lexfile: noun.cognition
part of speech: noun
hypernym: 05907175-n

06507319-n
type: LexicalConcept
in scheme: en-word.net
definition: an ordered list of times at which things are planned to occur
ili: i70591
lexfile: noun.communication
part of speech: noun
hypernym: 06492991-n