saw-v
type: LexicalEntry
canonical form: saw
sense: 01562372-v
part of speech: verb

01562372-v
type: LexicalConcept
in scheme: en-word.net
definition: cut with a saw
example: saw wood for the fireplace
ili: i29527
lexfile: verb.contact
part of speech: verb
hypernym: 01555301-v

power saw-n
type: LexicalEntry
canonical form: power saw
sense: 04002503-n
part of speech: noun

saw-n
type: LexicalEntry
canonical form: saw
sense: 04002503-n
part of speech: noun
sense: 04147147-n
sense: 07168546-n

sawing machine-n
type: LexicalEntry
canonical form: sawing machine
sense: 04002503-n
part of speech: noun

04002503-n
type: LexicalConcept
in scheme: en-word.net
definition: a power tool for cutting wood
ili: i57630
lexfile: noun.artifact
part of speech: noun
hypernym: 04003842-n
mero part: 04460119-n

04147147-n
type: LexicalConcept
in scheme: en-word.net
definition: hand tool having a toothed blade for cutting
ili: i58480
lexfile: noun.artifact
part of speech: noun
hypernym: 03494245-n
mero part: 04148041-n
mero part: 04460119-n

proverb-n
type: LexicalEntry
canonical form: proverb
sense: 07168546-n
part of speech: noun

adage-n
type: LexicalEntry
canonical form: adage
sense: 07168546-n
part of speech: noun

byword-n
type: LexicalEntry
canonical form: byword
sense: 07168546-n
part of speech: noun

07168546-n
type: LexicalConcept
in scheme: en-word.net
definition: a condensed but memorable saying embodying some important fact of experience that is taken as true by many people
ili: i74258
lexfile: noun.communication
part of speech: noun
hypernym: 07166088-n