satsuma-n
type: LexicalEntry
canonical form: satsuma
sense: 07764252-n
part of speech: noun
sense: 12731337-n

07764252-n
type: LexicalConcept
in scheme: en-word.net
definition: medium-sized largely seedless mandarin orange with thin smooth skin
ili: i77766
lexfile: noun.food
part of speech: noun
hypernym: 07763927-n

satsuma tree-n
type: LexicalEntry
canonical form: satsuma tree
sense: 12731337-n
part of speech: noun

12731337-n
type: LexicalConcept
in scheme: en-word.net
definition: a variety of mandarin orange, known commonly as cold hardy mandarin, Christmas orange, or tangerine
ili: i103647
lexfile: noun.plant
part of speech: noun
hypernym: 12730661-n
mero part: 07764252-n