sandwich-v
type: LexicalEntry
canonical form: sandwich
sense: 01532694-v
part of speech: verb
sense: 01668976-v

01532694-v
type: LexicalConcept
in scheme: en-word.net
definition: insert or squeeze tightly between two people or objects
example: She was sandwiched in her airplane seat between two fat men
ili: i29380
lexfile: verb.contact
part of speech: verb
hypernym: 01424276-v

01668976-v
type: LexicalConcept
in scheme: en-word.net
definition: make into a sandwich
ili: i30058
lexfile: verb.creation
part of speech: verb
hypernym: 01654986-v

sandwich-n
type: LexicalEntry
canonical form: sandwich
sense: 07711710-n
part of speech: noun

07711710-n
type: LexicalConcept
in scheme: en-word.net
definition: two (or more) slices of bread with a filling between them
ili: i77427
lexfile: noun.food
part of speech: noun
hypernym: 07728127-n
mero part: 07695101-n