samba-n
type: LexicalEntry
canonical form: samba
sense: 00498436-n
part of speech: noun
sense: 00538229-n
sense: 07070935-n
sense: 12222455-n

00498436-n
type: LexicalConcept
in scheme: en-word.net
definition: a form of canasta using three decks of cards and six jokers
ili: i37992
lexfile: noun.act
part of speech: noun
hypernym: 00498071-n

00538229-n
type: LexicalConcept
in scheme: en-word.net
definition: a lively dance from Brazil, with roots from Africa
ili: i38209
lexfile: noun.act
part of speech: noun
hypernym: 00535886-n

samba-v
type: LexicalEntry
canonical form: samba
sense: 01900874-v
part of speech: verb

01900874-v
type: LexicalConcept
in scheme: en-word.net
definition: dance the samba
ili: i31195
lexfile: verb.motion
part of speech: verb
hypernym: 01712535-v

07070935-n
type: LexicalConcept
in scheme: en-word.net
definition: music composed for dancing the samba
ili: i73766
lexfile: noun.communication
part of speech: noun
hypernym: 07068473-n

obeche-n
type: LexicalEntry
canonical form: obeche
sense: 12222455-n
part of speech: noun

obechi-n
type: LexicalEntry
canonical form: obechi
sense: 12222455-n
part of speech: noun

arere-n
type: LexicalEntry
canonical form: arere
sense: 12222455-n
part of speech: noun

Triplochiton scleroxcylon-n
type: LexicalEntry
canonical form: Triplochiton scleroxcylon
sense: 12222455-n
part of speech: noun

Triplochiton scleroxylon-n
type: LexicalEntry
canonical form: Triplochiton scleroxylon
sense: 12222455-n
part of speech: noun

12222455-n
type: LexicalConcept
in scheme: en-word.net
definition: large west African tree having large palmately lobed leaves and axillary cymose panicles of small white flowers and one-winged seeds; yields soft white to pale yellow wood
ili: i101247
lexfile: noun.plant
part of speech: noun
hypernym: 13124818-n