rudiments-n
type: LexicalEntry
canonical form: rudiments
sense: 05881364-n
part of speech: noun
sense: 06652212-n

first principles-n
type: LexicalEntry
canonical form: first principles
sense: 05881364-n
part of speech: noun

alphabet-n
type: LexicalEntry
canonical form: alphabet
sense: 05881364-n
part of speech: noun

05881364-n
type: LexicalConcept
in scheme: en-word.net
definition: the elementary stages of any subject (usually plural)
example: he mastered only the rudiments of geometry
ili: i67734
lexfile: noun.cognition
part of speech: noun
exemplifies: 06306016-n
hypernym: 05879984-n

basics-n
type: LexicalEntry
canonical form: basics
sense: 06652212-n
part of speech: noun

06652212-n
type: LexicalConcept
in scheme: en-word.net
definition: a statement of fundamental facts or principles
ili: i71371
lexfile: noun.communication
part of speech: noun
hypernym: 06648784-n