royal-n
type: LexicalEntry
canonical form: royal
sense: 02433289-n
part of speech: noun

royal stag-n
type: LexicalEntry
canonical form: royal stag
sense: 02433289-n
part of speech: noun

02433289-n
type: LexicalConcept
in scheme: en-word.net
definition: stag with antlers of 12 or more branches
ili: i48408
lexfile: noun.animal
part of speech: noun
hypernym: 02433205-n