arousal-n
type: LexicalEntry
canonical form: arousal
sense: 00243675-n
part of speech: noun

rousing-n
type: LexicalEntry
canonical form: rousing
sense: 00243675-n
part of speech: noun

00243675-n
type: LexicalConcept
in scheme: en-word.net
definition: the act of arousing
example: the purpose of art is the arousal of emotions
ili: i36676
lexfile: noun.act
part of speech: noun
hypernym: 00199979-n

rousing-a
type: LexicalEntry
canonical form: rousing
sense: 01903674-s
part of speech: adjective
sense: 02314706-s

01903674-s
type: LexicalConcept
in scheme: en-word.net
definition: rousing to activity or heightened action as by spurring or goading
example: tossed a rousing political comment into the conversation
ili: i10404
lexfile: adj.all
part of speech: adjective satellite
similar: https://en-word.net/synset/01902545-a

stirring-a
type: LexicalEntry
canonical form: stirring
sense: 02314706-s
part of speech: adjective

02314706-s
type: LexicalConcept
in scheme: en-word.net
definition: capable of arousing enthusiasm or excitement
example: a rousing sermon
example: stirring events such as wars and rescues
ili: i12775
lexfile: adj.all
part of speech: adjective satellite
similar: https://en-word.net/synset/02313968-a