wealth-n
type: LexicalEntry
canonical form: wealth
sense: 13374295-n
part of speech: noun

riches-n
type: LexicalEntry
canonical form: riches
sense: 13374295-n
part of speech: noun

13374295-n
type: LexicalConcept
in scheme: en-word.net
definition: an abundance of material possessions and resources
ili: i106878
lexfile: noun.possession
part of speech: noun
hypernym: 13374171-n