rhyme-v
type: LexicalEntry
canonical form: rhyme
sense: 01705717-v
part of speech: verb
sense: 02756307-v

rime-v
type: LexicalEntry
canonical form: rime
sense: 01705717-v
part of speech: verb
sense: 02756307-v

01705717-v
type: LexicalConcept
in scheme: en-word.net
definition: compose rhymes
ili: i30253
lexfile: verb.creation
part of speech: verb
domain topic: 07107220-n
hypernym: 01701711-v

02756307-v
type: LexicalConcept
in scheme: en-word.net
definition: be similar in sound, especially with respect to the last syllable
example: ‘hat’ and ‘cat’ rhyme
ili: i35428
lexfile: verb.stative
part of speech: verb
hypernym: 02663315-v

verse-n
type: LexicalEntry
canonical form: verse
sense: 06393492-n
part of speech: noun

rhyme-n
type: LexicalEntry
canonical form: rhyme
sense: 06393492-n
part of speech: noun
sense: 07111327-n

06393492-n
type: LexicalConcept
in scheme: en-word.net
definition: a piece of poetry
ili: i70017
lexfile: noun.communication
part of speech: noun
hypernym: 06389065-n

rime-n
type: LexicalEntry
canonical form: rime
sense: 07111327-n
part of speech: noun

07111327-n
type: LexicalConcept
in scheme: en-word.net
definition: correspondence in the sounds of two or more lines (especially final sounds)
ili: i73950
lexfile: noun.communication
part of speech: noun
hypernym: 07108269-n