retroflection-n
type: LexicalEntry
canonical form: retroflection
sense: 00342716-n
part of speech: noun
sense: 07146934-n
sense: 14555200-n

retroflexion-n
type: LexicalEntry
canonical form: retroflexion
sense: 00342716-n
part of speech: noun
sense: 07146934-n
sense: 14555200-n

00342716-n
type: LexicalConcept
in scheme: en-word.net
definition: the act of bending backward
ili: i37207
lexfile: noun.act
part of speech: noun
hypernym: 00332776-n

07146934-n
type: LexicalConcept
in scheme: en-word.net
definition: an articulatory gesture made by turning the tip of the tongue back against the roof of the mouth
ili: i74143
lexfile: noun.communication
part of speech: noun
hypernym: 07146562-n

retroversion-n
type: LexicalEntry
canonical form: retroversion
sense: 14555200-n
part of speech: noun

14555200-n
type: LexicalConcept
in scheme: en-word.net
definition: a turning or tilting backward of an organ or body part
example: retroversion of the uterus
ili: i113367
lexfile: noun.state
part of speech: noun
hypernym: 14525310-n