retaliation-n
type: LexicalEntry
canonical form: retaliation
sense: 01237823-n
part of speech: noun

revenge-n
type: LexicalEntry
canonical form: revenge
sense: 01237823-n
part of speech: noun

01237823-n
type: LexicalConcept
in scheme: en-word.net
definition: action taken in return for an injury or offense
ili: i41867
lexfile: noun.act
part of speech: noun
hypernym: 01237294-n