residency-n
type: LexicalEntry
canonical form: residency
sense: 00600179-n
part of speech: noun
sense: 01055844-n

00600179-n
type: LexicalConcept
in scheme: en-word.net
definition: the position of physician who is receiving special training in a hospital (usually after completing an internship)
ili: i38567
lexfile: noun.act
part of speech: noun
hypernym: 00587299-n

residence-n
type: LexicalEntry
canonical form: residence
sense: 01055844-n
part of speech: noun

abidance-n
type: LexicalEntry
canonical form: abidance
sense: 01055844-n
part of speech: noun

01055844-n
type: LexicalConcept
in scheme: en-word.net
definition: the act of dwelling in a place
ili: i40932
lexfile: noun.act
part of speech: noun
hypernym: 00030657-n