residency-n
type: LexicalEntry
canonical form: residency
sense: 01055844-n
part of speech: noun

residence-n
type: LexicalEntry
canonical form: residence
sense: 01055844-n
part of speech: noun
sense: 03724592-n
sense: 04086356-n
sense: 08576500-n

abidance-n
type: LexicalEntry
canonical form: abidance
sense: 01055844-n
part of speech: noun

01055844-n
type: LexicalConcept
in scheme: en-word.net
definition: the act of dwelling in a place
ili: i40932
lexfile: noun.act
part of speech: noun
hypernym: 00030657-n

mansion-n
type: LexicalEntry
canonical form: mansion
sense: 03724592-n
part of speech: noun

mansion house-n
type: LexicalEntry
canonical form: mansion house
sense: 03724592-n
part of speech: noun

manse-n
type: LexicalEntry
canonical form: manse
sense: 03724592-n
part of speech: noun

hall-n
type: LexicalEntry
canonical form: hall
sense: 03724592-n
part of speech: noun

03724592-n
type: LexicalConcept
in scheme: en-word.net
definition: a large and imposing house
ili: i55999
lexfile: noun.artifact
part of speech: noun
hypernym: 03549540-n
mero part: 03724120-n

04086356-n
type: LexicalConcept
in scheme: en-word.net
definition: the official house or establishment of an important person (as a sovereign or president)
example: he refused to live in the governor's residence
ili: i58105
lexfile: noun.artifact
part of speech: noun
hypernym: 03549540-n

abode-n
type: LexicalEntry
canonical form: abode
sense: 08576500-n
part of speech: noun

08576500-n
type: LexicalConcept
in scheme: en-word.net
definition: any address at which you dwell more than temporarily
example: a person can have several residences
ili: i81962
lexfile: noun.location
part of speech: noun
hypernym: 08508037-n