renegociate-v
type: LexicalEntry
canonical form: renegociate
sense: 00764088-v
part of speech: verb
sense: 00764374-v

renegotiate-v
type: LexicalEntry
canonical form: renegotiate
sense: 00764088-v
part of speech: verb
sense: 00764374-v

00764088-v
type: LexicalConcept
in scheme: en-word.net
definition: revise the terms of in order to limit or regain excess profits gained by the contractor
example: We renegociated our old mortgage now that the interest rates have come down
ili: i25504
lexfile: verb.communication
part of speech: verb
domain topic: 06532935-n
hypernym: 00763758-v

00764374-v
type: LexicalConcept
in scheme: en-word.net
definition: negociate anew
example: The two warring parties will have to renegociate
ili: i25505
lexfile: verb.communication
part of speech: verb
hypernym: 00764523-v