reinsure-v
type: LexicalEntry
canonical form: reinsure
sense: 00893062-v
part of speech: verb
sense: 00893255-v
sense: 02256317-v

00893062-v
type: LexicalConcept
in scheme: en-word.net
definition: insure again by assuming all or a part of the liability of an insurance company already covering a risk
ili: i26076
lexfile: verb.communication
part of speech: verb
hypernym: 00892737-v

00893255-v
type: LexicalConcept
in scheme: en-word.net
definition: insure again by transferring to another insurance company all or a part of a liability assumed
ili: i26077
lexfile: verb.communication
part of speech: verb
hypernym: 02255873-v

02256317-v
type: LexicalConcept
in scheme: en-word.net
definition: provide additional insurance for
ili: i32994
lexfile: verb.possession
part of speech: verb
hypernym: 02255873-v