recuse-v
type: LexicalEntry
canonical form: recuse
sense: 00688150-v
part of speech: verb
sense: 00974899-v

00688150-v
type: LexicalConcept
in scheme: en-word.net
definition: challenge or except to a judge as being incompetent or interested, in canon and civil law
ili: i25146
lexfile: verb.cognition
part of speech: verb
domain topic: 08458195-n
hypernym: 00687584-v

00974899-v
type: LexicalConcept
in scheme: en-word.net
definition: disqualify oneself (as a judge) in a particular case
ili: i26456
lexfile: verb.communication
part of speech: verb
domain topic: 08458195-n
hypernym: 00974640-v