rate of exchange-n
type: LexicalEntry
canonical form: rate of exchange
sense: 13347642-n
part of speech: noun

exchange rate-n
type: LexicalEntry
canonical form: exchange rate
sense: 13347642-n
part of speech: noun

13347642-n
type: LexicalConcept
in scheme: en-word.net
definition: the charge for exchanging currency of one country for currency of another
ili: i106737
lexfile: noun.possession
part of speech: noun
hypernym: 13346032-n