ransom-n
type: LexicalEntry
canonical form: ransom
sense: 00097671-n
part of speech: noun
sense: 01123906-n
sense: 13305071-n

00097671-n
type: LexicalConcept
in scheme: en-word.net
definition: the act of freeing from captivity or punishment
ili: i35912
lexfile: noun.act
part of speech: noun
hypernym: 00046648-n

01123906-n
type: LexicalConcept
in scheme: en-word.net
definition: payment for the release of someone
ili: i41282
lexfile: noun.act
part of speech: noun
hypernym: 01122769-n

ransom-v
type: LexicalEntry
canonical form: ransom
sense: 02261806-v
part of speech: verb

redeem-v
type: LexicalEntry
canonical form: redeem
sense: 02261806-v
part of speech: verb

02261806-v
type: LexicalConcept
in scheme: en-word.net
definition: exchange or buy back for money; under threat
ili: i33022
lexfile: verb.possession
part of speech: verb
domain topic: 00767761-n
hypernym: 02262178-v

ransom money-n
type: LexicalEntry
canonical form: ransom money
sense: 13305071-n
part of speech: noun

13305071-n
type: LexicalConcept
in scheme: en-word.net
definition: money demanded for the return of a captured person
ili: i106475
lexfile: noun.possession
part of speech: noun
hypernym: 13296870-n