rambutan-n
type: LexicalEntry
canonical form: rambutan
sense: 07785707-n
part of speech: noun
sense: 12766146-n

rambotan-n
type: LexicalEntry
canonical form: rambotan
sense: 07785707-n
part of speech: noun
sense: 12766146-n

07785707-n
type: LexicalConcept
in scheme: en-word.net
definition: pleasantly acid bright red oval Malayan fruit covered with soft spines
ili: i77906
lexfile: noun.food
part of speech: noun
hypernym: 07721676-n

rambutan tree-n
type: LexicalEntry
canonical form: rambutan tree
sense: 12766146-n
part of speech: noun

Nephelium lappaceum-n
type: LexicalEntry
canonical form: Nephelium lappaceum
sense: 12766146-n
part of speech: noun

12766146-n
type: LexicalConcept
in scheme: en-word.net
definition: Malayan tree bearing spiny red fruit
ili: i103812
lexfile: noun.plant
part of speech: noun
hypernym: 12672582-n
mero part: 07785707-n