raggedness-n
type: LexicalEntry
canonical form: raggedness
sense: 04824399-n
part of speech: noun
sense: 04955418-n

04824399-n
type: LexicalConcept
in scheme: en-word.net
definition: shabbiness by virtue of being in rags
ili: i62314
lexfile: noun.attribute
part of speech: noun
hypernym: 04823992-n

roughness-n
type: LexicalEntry
canonical form: roughness
sense: 04955418-n
part of speech: noun

04955418-n
type: LexicalConcept
in scheme: en-word.net
definition: a texture of a surface or edge that is not smooth but is irregular and uneven
ili: i62982
lexfile: noun.attribute
part of speech: noun
hypernym: 04954054-n