quince-n
type: LexicalEntry
canonical form: quince
sense: 07785560-n
part of speech: noun
sense: 12649747-n

07785560-n
type: LexicalConcept
in scheme: en-word.net
definition: aromatic acid-tasting pear-shaped fruit used in preserves
ili: i77905
lexfile: noun.food
part of speech: noun
hypernym: 07721676-n
hypernym: 13159619-n

quince bush-n
type: LexicalEntry
canonical form: quince bush
sense: 12649747-n
part of speech: noun

Cydonia oblonga-n
type: LexicalEntry
canonical form: Cydonia oblonga
sense: 12649747-n
part of speech: noun

12649747-n
type: LexicalConcept
in scheme: en-word.net
definition: small Asian tree with pinkish flowers and pear-shaped fruit; widely cultivated
ili: i103248
lexfile: noun.plant
part of speech: noun
hypernym: 12672582-n
mero part: 07785560-n