quiescence-n
type: LexicalEntry
canonical form: quiescence
sense: 01066787-n
part of speech: noun
sense: 14035282-n

quiescency-n
type: LexicalEntry
canonical form: quiescency
sense: 01066787-n
part of speech: noun
sense: 14035282-n

dormancy-n
type: LexicalEntry
canonical form: dormancy
sense: 01066787-n
part of speech: noun
sense: 14035282-n

sleeping-n
type: LexicalEntry
canonical form: sleeping
sense: 01066787-n
part of speech: noun

01066787-n
type: LexicalConcept
in scheme: en-word.net
definition: quiet and inactive restfulness
ili: i40991
lexfile: noun.act
part of speech: noun
hypernym: 01066072-n

14035282-n
type: LexicalConcept
in scheme: en-word.net
definition: a state of quiet (but possibly temporary) inaction
example: the volcano erupted after centuries of dormancy
ili: i110563
lexfile: noun.state
part of speech: noun
attribute: https://en-word.net/synset/00040908-a
hypernym: 14033619-n