quarantine-v
type: LexicalEntry
canonical form: quarantine
sense: 00497347-v
part of speech: verb

00497347-v
type: LexicalConcept
in scheme: en-word.net
definition: place into enforced isolation, as for medical reasons
example: My dog was quarantined before he could live in England
ili: i24189
lexfile: verb.change
part of speech: verb
hypernym: 00495205-v

quarantine-n
type: LexicalEntry
canonical form: quarantine
sense: 01204135-n
part of speech: noun
sense: 14438739-n

01204135-n
type: LexicalConcept
in scheme: en-word.net
definition: isolation to prevent the spread of infectious disease
ili: i41680
lexfile: noun.act
part of speech: noun
hypernym: 01204519-n

14438739-n
type: LexicalConcept
in scheme: en-word.net
definition: enforced isolation of patients suffering from a contagious disease in order to prevent the spread of disease
ili: i112760
lexfile: noun.state
part of speech: noun
hypernym: 14438119-n