putty-v
type: LexicalEntry
canonical form: putty
sense: 01367436-v
part of speech: verb

01367436-v
type: LexicalConcept
in scheme: en-word.net
definition: apply putty in order to fix or fill
example: putty the window sash
ili: i28525
lexfile: verb.contact
part of speech: verb
hypernym: 01366351-v

putty-n
type: LexicalEntry
canonical form: putty
sense: 14727958-n
part of speech: noun

14727958-n
type: LexicalConcept
in scheme: en-word.net
definition: a dough-like mixture of whiting and boiled linseed oil; used especially to patch woodwork or secure panes of glass
ili: i114264
lexfile: noun.substance
part of speech: noun
hypernym: 14728801-n
hypernym: 14730187-n