puncture-v
type: LexicalEntry
canonical form: puncture
sense: 00310772-v
part of speech: verb
sense: 00404705-v
sense: 00857916-v
sense: 01277535-v
sense: 01277746-v

00310772-v
type: LexicalConcept
in scheme: en-word.net
definition: be pierced or punctured
example: The tire punctured
ili: i23274
lexfile: verb.change
part of speech: verb
hypernym: 00334996-v

00404705-v
type: LexicalConcept
in scheme: en-word.net
definition: cause to lose air pressure or collapse by piercing
example: puncture an air balloon
ili: i23748
lexfile: verb.change
part of speech: verb
hypernym: 00404874-v

deflate-v
type: LexicalEntry
canonical form: deflate
sense: 00857916-v
part of speech: verb

00857916-v
type: LexicalConcept
in scheme: en-word.net
definition: reduce or lessen the size or importance of
example: The bad review of his work deflated his self-confidence
ili: i25910
lexfile: verb.communication
part of speech: verb
hypernym: 00857615-v

puncture-n
type: LexicalEntry
canonical form: puncture
sense: 00944804-n
part of speech: noun
sense: 04030790-n
sense: 07329258-n

00944804-n
type: LexicalConcept
in scheme: en-word.net
definition: the act of puncturing or perforating
ili: i40361
lexfile: noun.act
part of speech: noun
hypernym: 00408356-n

01277535-v
type: LexicalConcept
in scheme: en-word.net
definition: pierce with a pointed object; make a hole into
example: puncture a tire
ili: i28037
lexfile: verb.contact
part of speech: verb
hypernym: 01443719-v

01277746-v
type: LexicalConcept
in scheme: en-word.net
definition: make by piercing
example: puncture a hole
ili: i28038
lexfile: verb.contact
part of speech: verb
hypernym: 01620211-v

04030790-n
type: LexicalConcept
in scheme: en-word.net
definition: a small hole made by a sharp object
ili: i57780
lexfile: noun.artifact
part of speech: noun
hypernym: 03531378-n

07329258-n
type: LexicalConcept
in scheme: en-word.net
definition: loss of air pressure in a tire when a hole is made by some sharp object
ili: i75129
lexfile: noun.event
part of speech: noun
hypernym: 07329027-n