pumpkin-n
type: LexicalEntry
canonical form: pumpkin
sense: 07751486-n
part of speech: noun
sense: 12178960-n

07751486-n
type: LexicalConcept
in scheme: en-word.net
definition: usually large pulpy deep-yellow round fruit of the squash family maturing in late summer or early autumn
ili: i77686
lexfile: noun.food
part of speech: noun
hypernym: 07723196-n

pumpkin vine-n
type: LexicalEntry
canonical form: pumpkin vine
sense: 12178960-n
part of speech: noun

autumn pumpkin-n
type: LexicalEntry
canonical form: autumn pumpkin
sense: 12178960-n
part of speech: noun

Cucurbita pepo-n
type: LexicalEntry
canonical form: Cucurbita pepo
sense: 12178960-n
part of speech: noun

12178960-n
type: LexicalConcept
in scheme: en-word.net
definition: a coarse vine widely cultivated for its large pulpy round orange fruit with firm orange skin and numerous seeds; subspecies of Cucurbita pepo include the summer squashes and a few autumn squashes
ili: i101043
lexfile: noun.plant
part of speech: noun
hypernym: 12179315-n
mero part: 07751486-n
mero part: 07786739-n