pursuance-n
type: LexicalEntry
canonical form: pursuance
sense: 01023950-n
part of speech: noun

prosecution-n
type: LexicalEntry
canonical form: prosecution
sense: 01023950-n
part of speech: noun
sense: 01200797-n
sense: 08081578-n

01023950-n
type: LexicalConcept
in scheme: en-word.net
definition: the continuance of something begun with a view to its completion
ili: i40757
lexfile: noun.act
part of speech: noun
hypernym: 01019929-n

criminal prosecution-n
type: LexicalEntry
canonical form: criminal prosecution
sense: 01200797-n
part of speech: noun

01200797-n
type: LexicalConcept
in scheme: en-word.net
definition: the institution and conduct of legal proceedings against a defendant for criminal behavior
ili: i41666
lexfile: noun.act
part of speech: noun
domain topic: 08458195-n
hypernym: 01184392-n

08081578-n
type: LexicalConcept
in scheme: en-word.net
definition: the lawyers acting for the state to put the case against the defendant
ili: i79589
lexfile: noun.group
part of speech: noun
hypernym: 07968050-n