proclamation-n
type: LexicalEntry
canonical form: proclamation
sense: 01268984-n
part of speech: noun

promulgation-n
type: LexicalEntry
canonical form: promulgation
sense: 01268984-n
part of speech: noun
sense: 06739688-n
sense: 06759293-n

01268984-n
type: LexicalConcept
in scheme: en-word.net
definition: the formal act of proclaiming; giving public notice
example: his promulgation of the policy proved to be premature
ili: i42047
lexfile: noun.act
part of speech: noun
hypernym: 00030657-n

06739688-n
type: LexicalConcept
in scheme: en-word.net
definition: the official announcement of a new law or ordinance whereby the law or ordinance is put into effect
ili: i71852
lexfile: noun.communication
part of speech: noun
hypernym: 06738907-n

announcement-n
type: LexicalEntry
canonical form: announcement
sense: 06759293-n
part of speech: noun

06759293-n
type: LexicalConcept
in scheme: en-word.net
definition: a public statement containing information about an event that has happened or is going to happen
example: the announcement appeared in the local newspaper
example: the promulgation was written in English
ili: i71948
lexfile: noun.communication
part of speech: noun
hypernym: 06735202-n